Information card for entry 7706469
Formula | C27 H40 O Ru |
Calculated formula | C27 H40 O Ru |
Title of publication | Synthesis, characterization, and alkoxide transfer reactivity of dimeric Tl<sub>2</sub>(OR)<sub>2</sub> complexes. |
Authors of publication | Grass, Amanda; Kulathungage, Lakshani Wathsala; Wannipurage, Duleeka; Yousif, Maryam; Ward, Cassandra L.; Groysman, Stanislav |
Journal of publication | Dalton transactions (Cambridge, England : 2003) |
Year of publication | 2021 |
Journal volume | 50 |
Journal issue | 7 |
Pages of publication | 2501 - 2509 |
a | 8.1664 ± 0.0004 Å |
b | 10.4284 ± 0.0005 Å |
c | 14.7777 ± 0.0007 Å |
α | 106.093 ± 0.002° |
β | 98.321 ± 0.002° |
γ | 93.777 ± 0.002° |
Cell volume | 1189 ± 0.1 Å3 |
Cell temperature | 100 K |
Ambient diffraction temperature | 100 K |
Number of distinct elements | 4 |
Space group number | 2 |
Hermann-Mauguin space group symbol | P -1 |
Hall space group symbol | -P 1 |
Residual factor for all reflections | 0.0367 |
Residual factor for significantly intense reflections | 0.0303 |
Weighted residual factors for significantly intense reflections | 0.0734 |
Weighted residual factors for all reflections included in the refinement | 0.0762 |
Goodness-of-fit parameter for all reflections included in the refinement | 1.078 |
Diffraction radiation wavelength | 0.71073 Å |
Diffraction radiation type | MoKα |