Information card for entry 7706522
Formula | C28 H17 O2 P S2 |
Calculated formula | C28 H17 O2 P S2 |
SMILES | P12(Oc3c(O1)c1ccccc1c1c3cccc1)(c1ccccc1)c1c(scc1)c1sccc21 |
Title of publication | Structure-reactivity studies on hypervalent square-pyramidal dithieno[3,2-b:2',3'-d]phospholes. |
Authors of publication | Asok, Nayanthara; Gaffen, Joshua R.; Pradhan, Ekadashi; Zeng, Tao; Baumgartner, Thomas |
Journal of publication | Dalton transactions (Cambridge, England : 2003) |
Year of publication | 2021 |
Journal volume | 50 |
Journal issue | 6 |
Pages of publication | 2243 - 2252 |
a | 8.486 ± 0.003 Å |
b | 9.239 ± 0.003 Å |
c | 16.573 ± 0.006 Å |
α | 91.523 ± 0.014° |
β | 95.534 ± 0.011° |
γ | 106.919 ± 0.011° |
Cell volume | 1235.3 ± 0.7 Å3 |
Cell temperature | 173 ± 2 K |
Ambient diffraction temperature | 173 K |
Number of distinct elements | 5 |
Space group number | 2 |
Hermann-Mauguin space group symbol | P -1 |
Hall space group symbol | -P 1 |
Residual factor for all reflections | 0.0584 |
Residual factor for significantly intense reflections | 0.0549 |
Weighted residual factors for significantly intense reflections | 0.1531 |
Weighted residual factors for all reflections included in the refinement | 0.1591 |
Goodness-of-fit parameter for all reflections included in the refinement | 1.053 |
Diffraction radiation wavelength | 0.71073 Å |
Diffraction radiation type | MoKα |