Information card for entry 7706997
Formula | C21 H16 Cl2 Eu N3 O3 |
Calculated formula | C21 H16 Cl2 Eu N3 O3 |
SMILES | [Eu]12(Cl)(Cl)(Oc3c4n(=[O]1)cccc4ccc3)([OH2])[n]1cccc3ccc4ccc[n]2c4c13 |
Title of publication | High anticancer activity and apoptosis- and autophagy-inducing properties of novel lanthanide(III) complexes bearing 8-hydroxyquinoline-<i>N</i>-oxide and 1,10-phenanthroline. |
Authors of publication | Yang, Yan; Zhou, Zhen; Wei, Zu-Zhuang; Qin, Qi-Pin; Yang, Lin; Liang, Hong |
Journal of publication | Dalton transactions (Cambridge, England : 2003) |
Year of publication | 2021 |
Journal volume | 50 |
Journal issue | 17 |
Pages of publication | 5828 - 5834 |
a | 9.9054 ± 0.0003 Å |
b | 11.1091 ± 0.0003 Å |
c | 18.3023 ± 0.0007 Å |
α | 90° |
β | 92.827 ± 0.003° |
γ | 90° |
Cell volume | 2011.54 ± 0.11 Å3 |
Cell temperature | 293 ± 2 K |
Ambient diffraction temperature | 293 ± 2 K |
Number of distinct elements | 6 |
Space group number | 14 |
Hermann-Mauguin space group symbol | P 1 21/c 1 |
Hall space group symbol | -P 2ybc |
Residual factor for all reflections | 0.0458 |
Residual factor for significantly intense reflections | 0.032 |
Weighted residual factors for significantly intense reflections | 0.0608 |
Weighted residual factors for all reflections included in the refinement | 0.068 |
Goodness-of-fit parameter for all reflections included in the refinement | 1.038 |
Diffraction radiation probe | x-ray |
Diffraction radiation wavelength | 0.71073 Å |
Diffraction radiation type | MoKα |