Information card for entry 7706999
Formula | C21 H16 Cl2 Ho N3 O3 |
Calculated formula | C21 H16 Cl2 Ho N3 O3 |
SMILES | [Ho]12(Cl)(Cl)([OH2])(Oc3c4n(=[O]1)cccc4ccc3)[n]1c3c4[n]2cccc4ccc3ccc1 |
Title of publication | High anticancer activity and apoptosis- and autophagy-inducing properties of novel lanthanide(III) complexes bearing 8-hydroxyquinoline-<i>N</i>-oxide and 1,10-phenanthroline. |
Authors of publication | Yang, Yan; Zhou, Zhen; Wei, Zu-Zhuang; Qin, Qi-Pin; Yang, Lin; Liang, Hong |
Journal of publication | Dalton transactions (Cambridge, England : 2003) |
Year of publication | 2021 |
Journal volume | 50 |
Journal issue | 17 |
Pages of publication | 5828 - 5834 |
a | 9.8801 ± 0.0006 Å |
b | 11.0521 ± 0.0007 Å |
c | 18.2125 ± 0.0011 Å |
α | 90° |
β | 93.202 ± 0.002° |
γ | 90° |
Cell volume | 1985.6 ± 0.2 Å3 |
Cell temperature | 293 ± 2 K |
Ambient diffraction temperature | 293 ± 2 K |
Number of distinct elements | 6 |
Space group number | 14 |
Hermann-Mauguin space group symbol | P 1 21/c 1 |
Hall space group symbol | -P 2ybc |
Residual factor for all reflections | 0.0265 |
Residual factor for significantly intense reflections | 0.0221 |
Weighted residual factors for significantly intense reflections | 0.0501 |
Weighted residual factors for all reflections included in the refinement | 0.0516 |
Goodness-of-fit parameter for all reflections included in the refinement | 1.075 |
Diffraction radiation wavelength | 0.71073 Å |
Diffraction radiation type | MoKα |