Information card for entry 7707178
Formula | C42 H24 Fe N6 O4 S4 |
Calculated formula | C42 H24 Fe N6 O4 S4 |
Title of publication | Thermo- and photoinduced spin state switching in an iron(II) 2D coordination network associated with large light-induced thermal hysteresis and tuning of dimensionality <i>via</i> ligand modulation. |
Authors of publication | Ghosh, Subrata; Kamilya, Sujit; Pramanik, Titas; Mohanty, Ashutosh; Rouzières, Mathieu; Herchel, Radovan; Mehta, Sakshi; Mondal, Abhishake |
Journal of publication | Dalton transactions (Cambridge, England : 2003) |
Year of publication | 2021 |
Journal volume | 50 |
Journal issue | 22 |
Pages of publication | 7725 - 7735 |
a | 13.6023 ± 0.0007 Å |
b | 28.4252 ± 0.0015 Å |
c | 28.374 ± 0.0013 Å |
α | 90° |
β | 90° |
γ | 90° |
Cell volume | 10970.8 ± 1 Å3 |
Cell temperature | 200 ± 2 K |
Ambient diffraction temperature | 200 ± 2 K |
Number of distinct elements | 6 |
Space group number | 68 |
Hermann-Mauguin space group symbol | C c c a :2 |
Hall space group symbol | -C 2a 2ac |
Residual factor for all reflections | 0.1166 |
Residual factor for significantly intense reflections | 0.0643 |
Weighted residual factors for significantly intense reflections | 0.1565 |
Weighted residual factors for all reflections included in the refinement | 0.1833 |
Goodness-of-fit parameter for all reflections included in the refinement | 0.958 |
Diffraction radiation wavelength | 0.71073 Å |
Diffraction radiation type | MoKα |