Information card for entry 7707876
Chemical name | compound 11 |
Formula | C38 H86 Si8 Sn2 |
Calculated formula | C38 H86 Si8 Sn2 |
Title of publication | Diverse reactions of a fluorostannylenoid towards ethynes. |
Authors of publication | Yan, Liping; Yan, Chenting; Xu, Jian; Yang, Lele; Bian, Gaofeng; Wang, Liliang; Kira, Mitsuo; Li, Zhifang |
Journal of publication | Dalton transactions (Cambridge, England : 2003) |
Year of publication | 2021 |
Journal volume | 50 |
Journal issue | 31 |
Pages of publication | 10806 - 10810 |
a | 11.754 ± 0.0006 Å |
b | 15.381 ± 0.0008 Å |
c | 16.6332 ± 0.0009 Å |
α | 65.538 ± 0.001° |
β | 77.719 ± 0.001° |
γ | 85.896 ± 0.001° |
Cell volume | 2674.1 ± 0.2 Å3 |
Cell temperature | 296 ± 2 K |
Ambient diffraction temperature | 296 ± 2 K |
Number of distinct elements | 4 |
Space group number | 2 |
Hermann-Mauguin space group symbol | P -1 |
Hall space group symbol | -P 1 |
Residual factor for all reflections | 0.0421 |
Residual factor for significantly intense reflections | 0.0284 |
Weighted residual factors for significantly intense reflections | 0.0931 |
Weighted residual factors for all reflections included in the refinement | 0.1307 |
Goodness-of-fit parameter for all reflections included in the refinement | 1.127 |
Diffraction radiation wavelength | 0.71073 Å |
Diffraction radiation type | MoKα |