Information card for entry 7707889
Formula | C47 H79 N O P2 Si4 U |
Calculated formula | C47 H79 N O P2 Si4 U |
Title of publication | Synthesis and reactivity of the uranium phosphinidene metallocene [η<sup>5</sup>-1,3-(Me<sub>3</sub>Si)<sub>2</sub>C<sub>5</sub>H<sub>3</sub>]<sub>2</sub>U(P-2,4,6-<sup>i</sup>Pr<sub>3</sub>C<sub>6</sub>H<sub>2</sub>)(OPMe<sub>3</sub>): influence of the coordinated Lewis base. |
Authors of publication | Wang, Shichun; Heng, Yi; Li, Tongyu; Hou, Guohua; Zi, Guofu; Walter, Marc D. |
Journal of publication | Dalton transactions (Cambridge, England : 2003) |
Year of publication | 2021 |
Journal volume | 50 |
Journal issue | 36 |
Pages of publication | 12502 - 12516 |
a | 11.516 ± 0.0002 Å |
b | 14.2653 ± 0.0002 Å |
c | 17.1503 ± 0.0001 Å |
α | 101.502 ± 0.001° |
β | 101.447 ± 0.001° |
γ | 98.356 ± 0.001° |
Cell volume | 2655.32 ± 0.06 Å3 |
Cell temperature | 100 ± 0.1 K |
Ambient diffraction temperature | 100 ± 0.1 K |
Number of distinct elements | 7 |
Space group number | 2 |
Hermann-Mauguin space group symbol | P -1 |
Hall space group symbol | -P 1 |
Residual factor for all reflections | 0.0276 |
Residual factor for significantly intense reflections | 0.0268 |
Weighted residual factors for significantly intense reflections | 0.0689 |
Weighted residual factors for all reflections included in the refinement | 0.0693 |
Goodness-of-fit parameter for all reflections included in the refinement | 1.104 |
Diffraction radiation probe | x-ray |
Diffraction radiation wavelength | 1.54184 Å |
Diffraction radiation type | CuKα |