Information card for entry 7707897
Formula | C34 H56 Cr N2 Si2 |
Calculated formula | C34 H56 Cr N2 Si2 |
Title of publication | Homoleptic quasilinear metal(i/ii) silylamides of Cr-Co with phenyl and allyl functions - impact of the oxidation state on secondary ligand interactions. |
Authors of publication | Weller, Ruth; Ruppach, Lutz; Shlyaykher, Alena; Tambornino, Frank; Werncke, C. Gunnar |
Journal of publication | Dalton transactions (Cambridge, England : 2003) |
Year of publication | 2021 |
Journal volume | 50 |
Journal issue | 31 |
Pages of publication | 10947 - 10963 |
a | 9.5587 ± 0.0005 Å |
b | 12.8751 ± 0.0007 Å |
c | 16.1547 ± 0.0008 Å |
α | 67.981 ± 0.002° |
β | 86.382 ± 0.002° |
γ | 70.002 ± 0.002° |
Cell volume | 1727.15 ± 0.16 Å3 |
Cell temperature | 100 K |
Ambient diffraction temperature | 100 K |
Number of distinct elements | 5 |
Space group number | 2 |
Hermann-Mauguin space group symbol | P -1 |
Hall space group symbol | -P 1 |
Residual factor for all reflections | 0.0485 |
Residual factor for significantly intense reflections | 0.0364 |
Weighted residual factors for significantly intense reflections | 0.0893 |
Weighted residual factors for all reflections included in the refinement | 0.0957 |
Goodness-of-fit parameter for all reflections included in the refinement | 1.027 |
Diffraction radiation probe | x-ray |
Diffraction radiation wavelength | 0.71073 Å |
Diffraction radiation type | MoKα |