Information card for entry 7707903
Formula | C72 H113 Co K N3 O8 Si2 |
Calculated formula | C72 H113 Co K N3 O8 Si2 |
Title of publication | Homoleptic quasilinear metal(i/ii) silylamides of Cr-Co with phenyl and allyl functions - impact of the oxidation state on secondary ligand interactions. |
Authors of publication | Weller, Ruth; Ruppach, Lutz; Shlyaykher, Alena; Tambornino, Frank; Werncke, C. Gunnar |
Journal of publication | Dalton transactions (Cambridge, England : 2003) |
Year of publication | 2021 |
Journal volume | 50 |
Journal issue | 31 |
Pages of publication | 10947 - 10963 |
a | 10.1708 ± 0.0006 Å |
b | 25.7371 ± 0.0018 Å |
c | 28.1136 ± 0.0015 Å |
α | 90° |
β | 90.265 ± 0.005° |
γ | 90° |
Cell volume | 7359.1 ± 0.8 Å3 |
Cell temperature | 100 K |
Ambient diffraction temperature | 100 K |
Number of distinct elements | 7 |
Space group number | 15 |
Hermann-Mauguin space group symbol | C 1 2/c 1 |
Hall space group symbol | -C 2yc |
Residual factor for all reflections | 0.0469 |
Residual factor for significantly intense reflections | 0.0341 |
Weighted residual factors for significantly intense reflections | 0.0871 |
Weighted residual factors for all reflections included in the refinement | 0.0913 |
Goodness-of-fit parameter for all reflections included in the refinement | 1.053 |
Diffraction radiation probe | x-ray |
Diffraction radiation wavelength | 0.71073 Å |
Diffraction radiation type | MoKα |