Information card for entry 7707916
Formula | C56 H90 Fe K N2 O7 Si2 |
Calculated formula | C56 H90 Fe K N2 O7 Si2 |
Title of publication | Homoleptic quasilinear metal(i/ii) silylamides of Cr-Co with phenyl and allyl functions - impact of the oxidation state on secondary ligand interactions. |
Authors of publication | Weller, Ruth; Ruppach, Lutz; Shlyaykher, Alena; Tambornino, Frank; Werncke, C. Gunnar |
Journal of publication | Dalton transactions (Cambridge, England : 2003) |
Year of publication | 2021 |
Journal volume | 50 |
Journal issue | 31 |
Pages of publication | 10947 - 10963 |
a | 18.141 ± 0.002 Å |
b | 19.993 ± 0.0019 Å |
c | 20.561 ± 0.002 Å |
α | 60.863 ± 0.007° |
β | 66.609 ± 0.009° |
γ | 79.327 ± 0.009° |
Cell volume | 5978 ± 1.2 Å3 |
Cell temperature | 100 K |
Ambient diffraction temperature | 100 K |
Number of distinct elements | 7 |
Space group number | 2 |
Hermann-Mauguin space group symbol | P -1 |
Hall space group symbol | -P 1 |
Residual factor for all reflections | 0.1104 |
Residual factor for significantly intense reflections | 0.0773 |
Weighted residual factors for significantly intense reflections | 0.2276 |
Weighted residual factors for all reflections included in the refinement | 0.242 |
Goodness-of-fit parameter for all reflections included in the refinement | 1.042 |
Diffraction radiation probe | x-ray |
Diffraction radiation wavelength | 0.71073 Å |
Diffraction radiation type | MoKα |
Diffraction radiation X-ray symbol | K-L~2,3~ |