Information card for entry 7707984
Common name | Tin(IV) Sulfate |
Formula | O8 S2 Sn |
Calculated formula | O8 S2 Sn |
Title of publication | The tin sulfates Sn(SO<sub>4</sub>)<sub>2</sub> and Sn2(SO4)3: crystal structures, optical and thermal properties. |
Authors of publication | Hämmer, Matthias; Netzsch, Philip; Klenner, Steffen; Neuschulz, Kai; Struckmann, Mona; Wickleder, Mathias S.; Daub, Michael; Hillebrecht, Harald; Pöttgen, Rainer; Höppe, Henning A |
Journal of publication | Dalton transactions (Cambridge, England : 2003) |
Year of publication | 2021 |
Journal volume | 50 |
Journal issue | 37 |
Pages of publication | 12913 - 12922 |
a | 5.0434 ± 0.0003 Å |
b | 10.6543 ± 0.0006 Å |
c | 10.6547 ± 0.0006 Å |
α | 90° |
β | 91.991 ± 0.002° |
γ | 90° |
Cell volume | 572.17 ± 0.06 Å3 |
Cell temperature | 200 ± 2 K |
Ambient diffraction temperature | 200 ± 2 K |
Number of distinct elements | 3 |
Space group number | 14 |
Hermann-Mauguin space group symbol | P 1 21/c 1 |
Hall space group symbol | -P 2ybc |
Residual factor for all reflections | 0.05 |
Residual factor for significantly intense reflections | 0.037 |
Weighted residual factors for significantly intense reflections | 0.0815 |
Weighted residual factors for all reflections included in the refinement | 0.0961 |
Goodness-of-fit parameter for all reflections included in the refinement | 1.146 |
Diffraction radiation wavelength | 0.71073 Å |
Diffraction radiation type | MoKα |