Information card for entry 7707992
Formula | C29 H58 Cu Dy Na O13 |
Calculated formula | C29 H58 Cu Dy Na O13 |
Title of publication | Two types of Ln<sub>2</sub>Cu<sub>2</sub> hydroxo-trimethylacetate complexes with 0D and 1D motifs: synthetic features, structural differences, and slow magnetic relaxation. |
Authors of publication | Bovkunova, Anna A.; Bazhina, Evgeniya S.; Evstifeev, Igor S.; Nelyubina, Yulia V.; Shmelev, Maxim A.; Babeshkin, Konstantin A.; Efimov, Nikolay N.; Kiskin, Mikhail A.; Eremenko, Igor L. |
Journal of publication | Dalton transactions (Cambridge, England : 2003) |
Year of publication | 2021 |
Journal volume | 50 |
Journal issue | 35 |
Pages of publication | 12275 - 12286 |
a | 11.8623 ± 0.0011 Å |
b | 13.4002 ± 0.0013 Å |
c | 14.7222 ± 0.0018 Å |
α | 111.336 ± 0.004° |
β | 92.57 ± 0.004° |
γ | 110.32 ± 0.003° |
Cell volume | 2004.5 ± 0.4 Å3 |
Cell temperature | 296.15 K |
Ambient diffraction temperature | 296.15 K |
Number of distinct elements | 6 |
Space group number | 2 |
Hermann-Mauguin space group symbol | P -1 |
Hall space group symbol | -P 1 |
Residual factor for all reflections | 0.0314 |
Residual factor for significantly intense reflections | 0.0282 |
Weighted residual factors for significantly intense reflections | 0.0567 |
Weighted residual factors for all reflections included in the refinement | 0.0592 |
Goodness-of-fit parameter for all reflections included in the refinement | 1.087 |
Diffraction radiation wavelength | 0.71073 Å |
Diffraction radiation type | MoKα |