Information card for entry 7707996
Formula | C44 H46 N4 O12 Y2 |
Calculated formula | C44 H46 N4 O12 Y2 |
Title of publication | Intense multi-colored luminescence in a series of rare-earth metal-organic frameworks with aliphatic linkers. |
Authors of publication | Demakov, Pavel A.; Ryadun, Alexey A.; Dorovatovskii, Pavel V.; Lazarenko, Vladimir A.; Samsonenko, Denis G.; Brylev, Konstantin A.; Fedin, Vladimir P.; Dybtsev, Danil N. |
Journal of publication | Dalton transactions (Cambridge, England : 2003) |
Year of publication | 2021 |
Journal volume | 50 |
Journal issue | 34 |
Pages of publication | 11899 - 11908 |
a | 10.3847 ± 0.0006 Å |
b | 17.547 ± 0.001 Å |
c | 12.203 ± 0.0006 Å |
α | 90° |
β | 103.354 ± 0.005° |
γ | 90° |
Cell volume | 2163.5 ± 0.2 Å3 |
Cell temperature | 129.9 ± 0.3 K |
Ambient diffraction temperature | 129.9 ± 0.3 K |
Number of distinct elements | 5 |
Space group number | 14 |
Hermann-Mauguin space group symbol | P 1 21/n 1 |
Hall space group symbol | -P 2yn |
Residual factor for all reflections | 0.0389 |
Residual factor for significantly intense reflections | 0.0293 |
Weighted residual factors for significantly intense reflections | 0.0599 |
Weighted residual factors for all reflections included in the refinement | 0.0624 |
Goodness-of-fit parameter for all reflections included in the refinement | 1.048 |
Diffraction radiation probe | x-ray |
Diffraction radiation wavelength | 0.71073 Å |
Diffraction radiation type | MoKα |