Information card for entry 7707998
Formula | C49.5 H49.5 N4.5 O12.5 Tb2 |
Calculated formula | C49.4976 H49.4984 N4.4996 O12.5 Tb2 |
Title of publication | Intense multi-colored luminescence in a series of rare-earth metal-organic frameworks with aliphatic linkers. |
Authors of publication | Demakov, Pavel A.; Ryadun, Alexey A.; Dorovatovskii, Pavel V.; Lazarenko, Vladimir A.; Samsonenko, Denis G.; Brylev, Konstantin A.; Fedin, Vladimir P.; Dybtsev, Danil N. |
Journal of publication | Dalton transactions (Cambridge, England : 2003) |
Year of publication | 2021 |
Journal volume | 50 |
Journal issue | 34 |
Pages of publication | 11899 - 11908 |
a | 10.411 ± 0.002 Å |
b | 17.893 ± 0.003 Å |
c | 12.831 ± 0.002 Å |
α | 90° |
β | 98.908 ± 0.003° |
γ | 90° |
Cell volume | 2361.4 ± 0.7 Å3 |
Cell temperature | 100 ± 2 K |
Ambient diffraction temperature | 100 ± 2 K |
Number of distinct elements | 5 |
Space group number | 14 |
Hermann-Mauguin space group symbol | P 1 21/n 1 |
Hall space group symbol | -P 2yn |
Residual factor for all reflections | 0.0703 |
Residual factor for significantly intense reflections | 0.0443 |
Weighted residual factors for significantly intense reflections | 0.1051 |
Weighted residual factors for all reflections included in the refinement | 0.1149 |
Goodness-of-fit parameter for all reflections included in the refinement | 1.031 |
Diffraction radiation wavelength | 0.79475 Å |
Diffraction radiation type | synchrotron |