Information card for entry 7708022
Formula | C40 H36 Cl4 Dy2 F8 N4 O22 Ru2 |
Calculated formula | C40 H36 Cl4 Dy2 F8 N4 O22 Ru2 |
Title of publication | Enhancing the barrier height for magnetization reversal in 4d/4f RuIII2LnIII2 "butterfly" single molecule magnets (Ln = Gd, Dy) <i>via</i> targeted structural alterations. |
Authors of publication | Swain, Abinash; Martin, Robert; Vignesh, Kuduva R.; Rajaraman, Gopalan; Murray, Keith S.; Langley, Stuart K. |
Journal of publication | Dalton transactions (Cambridge, England : 2003) |
Year of publication | 2021 |
Journal volume | 50 |
Journal issue | 35 |
Pages of publication | 12265 - 12274 |
a | 15.536 ± 0.003 Å |
b | 16.01 ± 0.003 Å |
c | 12.208 ± 0.002 Å |
α | 90° |
β | 121.06 ± 0.03° |
γ | 90° |
Cell volume | 2601.2 ± 1.2 Å3 |
Cell temperature | 123 ± 2 K |
Ambient diffraction temperature | 123 ± 2 K |
Number of distinct elements | 8 |
Space group number | 12 |
Hermann-Mauguin space group symbol | C 1 2/m 1 |
Hall space group symbol | -C 2y |
Residual factor for all reflections | 0.1288 |
Residual factor for significantly intense reflections | 0.1288 |
Weighted residual factors for significantly intense reflections | 0.3014 |
Weighted residual factors for all reflections included in the refinement | 0.3014 |
Goodness-of-fit parameter for all reflections included in the refinement | 1.207 |
Diffraction radiation wavelength | 0.71073 Å |
Diffraction radiation type | MoKα |