Information card for entry 7708025
Formula | C34 H60 Gd2 N4 O20 Ru2 |
Calculated formula | C34 H60 Gd2 N4 O20 Ru2 |
Title of publication | Enhancing the barrier height for magnetization reversal in 4d/4f RuIII2LnIII2 "butterfly" single molecule magnets (Ln = Gd, Dy) <i>via</i> targeted structural alterations. |
Authors of publication | Swain, Abinash; Martin, Robert; Vignesh, Kuduva R.; Rajaraman, Gopalan; Murray, Keith S.; Langley, Stuart K. |
Journal of publication | Dalton transactions (Cambridge, England : 2003) |
Year of publication | 2021 |
Journal volume | 50 |
Journal issue | 35 |
Pages of publication | 12265 - 12274 |
a | 10.343 ± 0.002 Å |
b | 11.205 ± 0.002 Å |
c | 11.25 ± 0.002 Å |
α | 67.17 ± 0.03° |
β | 74.35 ± 0.03° |
γ | 84.09 ± 0.03° |
Cell volume | 1157.1 ± 0.5 Å3 |
Cell temperature | 150 ± 2 K |
Ambient diffraction temperature | 150 ± 2 K |
Number of distinct elements | 6 |
Space group number | 2 |
Hermann-Mauguin space group symbol | P -1 |
Hall space group symbol | -P 1 |
Residual factor for all reflections | 0.0268 |
Residual factor for significantly intense reflections | 0.0266 |
Weighted residual factors for significantly intense reflections | 0.0635 |
Weighted residual factors for all reflections included in the refinement | 0.0636 |
Goodness-of-fit parameter for all reflections included in the refinement | 1.086 |
Diffraction radiation wavelength | 0.71073 Å |
Diffraction radiation type | synchrotron |