Information card for entry 7708061
Formula | C65 H56 Ag O Os P3 |
Calculated formula | C65 H56 Ag O Os P3 |
Title of publication | Facile synthesis of air-stable heterobimetallic osmium-silver hydride complexes. |
Authors of publication | Zhou, Haiyu; Bai, Tongtong; Pan, Yanlin; Wei, Yongliang; Wang, Tongdao |
Journal of publication | Dalton transactions (Cambridge, England : 2003) |
Year of publication | 2021 |
Journal volume | 50 |
Journal issue | 35 |
Pages of publication | 12093 - 12097 |
a | 13.1963 ± 0.0004 Å |
b | 29.4703 ± 0.001 Å |
c | 13.9338 ± 0.0004 Å |
α | 90° |
β | 97.028 ± 0.001° |
γ | 90° |
Cell volume | 5378.1 ± 0.3 Å3 |
Cell temperature | 120 ± 2 K |
Ambient diffraction temperature | 120.15 K |
Number of distinct elements | 6 |
Space group number | 14 |
Hermann-Mauguin space group symbol | P 1 21/n 1 |
Hall space group symbol | -P 2yn |
Residual factor for all reflections | 0.0449 |
Residual factor for significantly intense reflections | 0.0379 |
Weighted residual factors for significantly intense reflections | 0.0947 |
Weighted residual factors for all reflections included in the refinement | 0.1004 |
Goodness-of-fit parameter for all reflections included in the refinement | 1.05 |
Diffraction radiation probe | x-ray |
Diffraction radiation wavelength | 0.71073 Å |
Diffraction radiation type | MoKα |