Information card for entry 7708079
Formula | C30 H30 Cl F2 N4 O2 Y |
Calculated formula | C30 H30 Cl F2 N4 O2 Y |
SMILES | [Y]12345(Cl)Oc6c(C[N]3(Cc3[n]2cc(F)cc3)CC[N]4(Cc2[n]5cc(F)cc2)Cc2cc(C)ccc2O1)cc(C)cc6 |
Title of publication | Improving the single-molecule magnet properties of two pentagonal bipyramidal Dy<sup>3+</sup> compounds by the introduction of both electron-withdrawing and -donating groups. |
Authors of publication | Zhu, Li; Dong, Yubao; Yin, Bing; Ma, Pengtao; Li, Dongfeng |
Journal of publication | Dalton transactions (Cambridge, England : 2003) |
Year of publication | 2021 |
Journal volume | 50 |
Journal issue | 36 |
Pages of publication | 12607 - 12618 |
a | 8.6179 ± 0.0013 Å |
b | 18.254 ± 0.003 Å |
c | 17.868 ± 0.003 Å |
α | 90° |
β | 91.093 ± 0.002° |
γ | 90° |
Cell volume | 2810.3 ± 0.8 Å3 |
Cell temperature | 296.15 K |
Ambient diffraction temperature | 296.15 K |
Number of distinct elements | 7 |
Space group number | 14 |
Hermann-Mauguin space group symbol | P 1 21/n 1 |
Hall space group symbol | -P 2yn |
Residual factor for all reflections | 0.0437 |
Residual factor for significantly intense reflections | 0.0306 |
Weighted residual factors for significantly intense reflections | 0.0774 |
Weighted residual factors for all reflections included in the refinement | 0.0827 |
Goodness-of-fit parameter for all reflections included in the refinement | 1.02 |
Diffraction radiation wavelength | 0.71073 Å |
Diffraction radiation type | MoKα |