Information card for entry 7708111
Formula | C70 H40 Co N10 O8 S2 |
Calculated formula | C70 H40 Co N10 O8 S2 |
Title of publication | Reversible single-crystal to single-crystal phase transformation between a new Werner clathrate and its apohost. |
Authors of publication | Matos, Catiúcia R M O; Sanii, Rana; Wang, Shi-Qiang; Ronconi, Célia M; Zaworotko, Michael J. |
Journal of publication | Dalton transactions (Cambridge, England : 2003) |
Year of publication | 2021 |
Journal volume | 50 |
Journal issue | 37 |
Pages of publication | 12923 - 12930 |
a | 7.5777 ± 0.0007 Å |
b | 23.58 ± 0.002 Å |
c | 15.5948 ± 0.0015 Å |
α | 90° |
β | 98.786 ± 0.003° |
γ | 90° |
Cell volume | 2753.8 ± 0.4 Å3 |
Cell temperature | 101 ± 2 K |
Ambient diffraction temperature | 101 K |
Number of distinct elements | 6 |
Space group number | 14 |
Hermann-Mauguin space group symbol | P 1 21/n 1 |
Hall space group symbol | -P 2yn |
Residual factor for all reflections | 0.0655 |
Residual factor for significantly intense reflections | 0.0529 |
Weighted residual factors for significantly intense reflections | 0.1594 |
Weighted residual factors for all reflections included in the refinement | 0.1729 |
Goodness-of-fit parameter for all reflections included in the refinement | 1.361 |
Diffraction radiation wavelength | 0.71073 Å |
Diffraction radiation type | MoKα |