Information card for entry 7708132
Formula | C20 H30 F6 N P Ru |
Calculated formula | C20 H30 F6 N P Ru |
Title of publication | Synthesis, structures, and reactivity of isomers of [RuCp*(1,4-(Me<sub>2</sub>N)<sub>2</sub>C<sub>6</sub>H<sub>4</sub>)]<sub>2</sub>. |
Authors of publication | Longhi, Elena; Risko, Chad; Bacsa, John; Khrustalev, Victor; Rigin, Sergei; Moudgil, Karttikay; Timofeeva, Tatiana V.; Marder, Seth R.; Barlow, Stephen |
Journal of publication | Dalton transactions (Cambridge, England : 2003) |
Year of publication | 2021 |
Journal volume | 50 |
Journal issue | 37 |
Pages of publication | 13020 - 13030 |
a | 39.31 ± 0.007 Å |
b | 7.127 ± 0.0013 Å |
c | 16.505 ± 0.003 Å |
α | 90° |
β | 113.299 ± 0.003° |
γ | 90° |
Cell volume | 4247 ± 1.3 Å3 |
Cell temperature | 100 ± 2 K |
Ambient diffraction temperature | 100 ± 2 K |
Number of distinct elements | 6 |
Space group number | 15 |
Hermann-Mauguin space group symbol | C 1 2/c 1 |
Hall space group symbol | -C 2yc |
Residual factor for all reflections | 0.0688 |
Residual factor for significantly intense reflections | 0.0489 |
Weighted residual factors for significantly intense reflections | 0.0997 |
Weighted residual factors for all reflections included in the refinement | 0.1089 |
Goodness-of-fit parameter for all reflections included in the refinement | 0.967 |
Diffraction radiation wavelength | 0.71073 Å |
Diffraction radiation type | MoKα |