Information card for entry 7708149
Formula | C39 H34.5 N1.5 O3 P2 |
Calculated formula | C39 H34.5 N1.5 O3 P2 |
SMILES | P(=N[P+](c1ccccc1)(c1ccccc1)c1ccccc1)(c1ccccc1)(c1ccccc1)c1ccccc1.O=C([O-])OC.N#CC |
Title of publication | Heavy silylchalcogenido lanthanates synthesis Ph<sub>4</sub>P[Cp<sub>3</sub>La-ESiMe<sub>3</sub>] (E = S, Se, and Te) <i>via</i> fluoride-induced demethylation of dimethylcarbonate to Ph<sub>4</sub>P[OCO<sub>2</sub>Me] key intermediate. |
Authors of publication | Guschlbauer, Jannick; Vollgraff, Tobias; Xie, Xiulan; Fetoh, Ahmed; Sundermeyer, Jörg |
Journal of publication | Dalton transactions (Cambridge, England : 2003) |
Year of publication | 2021 |
Journal volume | 50 |
Journal issue | 37 |
Pages of publication | 13103 - 13111 |
a | 10.62 ± 0.002 Å |
b | 35.75 ± 0.007 Å |
c | 17.32 ± 0.003 Å |
α | 90° |
β | 97.36 ± 0.03° |
γ | 90° |
Cell volume | 6522 ± 2 Å3 |
Cell temperature | 100 ± 2 K |
Ambient diffraction temperature | 100 ± 2 K |
Number of distinct elements | 5 |
Space group number | 14 |
Hermann-Mauguin space group symbol | P 1 21/c 1 |
Hall space group symbol | -P 2ybc |
Residual factor for all reflections | 0.0544 |
Residual factor for significantly intense reflections | 0.0412 |
Weighted residual factors for significantly intense reflections | 0.0905 |
Weighted residual factors for all reflections included in the refinement | 0.0961 |
Goodness-of-fit parameter for all reflections included in the refinement | 1.093 |
Diffraction radiation wavelength | 0.71073 Å |
Diffraction radiation type | MoKα |