Information card for entry 7708163
Formula | C6 H6 K N9 O8 |
Calculated formula | C6 H6 K N9 O8 |
Title of publication | Novel metal-organic frameworks assembled from the combination of polynitro-pyrazole and 5-nitroamine-1,2,4-oxadiazole: synthesis, structure and thermal properties. |
Authors of publication | Yang, Feng; Xu, Yuangang; Wang, Pengcheng; Lin, Qiuhan; Lu, Ming |
Journal of publication | Dalton transactions (Cambridge, England : 2003) |
Year of publication | 2021 |
Journal volume | 50 |
Journal issue | 37 |
Pages of publication | 12906 - 12912 |
a | 7.1587 ± 0.0006 Å |
b | 8.4966 ± 0.0007 Å |
c | 11.1631 ± 0.001 Å |
α | 97.197 ± 0.003° |
β | 99.588 ± 0.003° |
γ | 90.474 ± 0.003° |
Cell volume | 663.94 ± 0.1 Å3 |
Cell temperature | 296 ± 2 K |
Ambient diffraction temperature | 296 ± 2 K |
Number of distinct elements | 5 |
Space group number | 2 |
Hermann-Mauguin space group symbol | P -1 |
Hall space group symbol | -P 1 |
Residual factor for all reflections | 0.0778 |
Residual factor for significantly intense reflections | 0.0527 |
Weighted residual factors for significantly intense reflections | 0.1199 |
Weighted residual factors for all reflections included in the refinement | 0.1327 |
Goodness-of-fit parameter for all reflections included in the refinement | 1.026 |
Diffraction radiation wavelength | 0.71073 Å |
Diffraction radiation type | MoKα |