Information card for entry 7708234
Formula | C52 H42 Au2 F6 N2 O10 P2 S2 |
Calculated formula | C52 H42 Au2 F6 N2 O10 P2 S2 |
Title of publication | Intramolecular aurophilic interactions in dinuclear gold(I) complexes with twisted bridging 2,2'-bipyridine ligands. |
Authors of publication | Shmelev, Nikita Y.; Okubazghi, Tesfu H.; Abramov, Pavel A.; Komarov, Vladislav Y.; Rakhmanova, Mariana I.; Novikov, Alexander S.; Gushchin, Artem L. |
Journal of publication | Dalton transactions (Cambridge, England : 2003) |
Year of publication | 2021 |
Journal volume | 50 |
Journal issue | 36 |
Pages of publication | 12448 - 12456 |
a | 11.0607 ± 0.0005 Å |
b | 21.8487 ± 0.001 Å |
c | 22.2046 ± 0.0011 Å |
α | 90° |
β | 103.878 ± 0.002° |
γ | 90° |
Cell volume | 5209.4 ± 0.4 Å3 |
Cell temperature | 150 ± 2 K |
Ambient diffraction temperature | 150 ± 2 K |
Number of distinct elements | 8 |
Space group number | 14 |
Hermann-Mauguin space group symbol | P 1 21/c 1 |
Hall space group symbol | -P 2ybc |
Residual factor for all reflections | 0.0437 |
Residual factor for significantly intense reflections | 0.0334 |
Weighted residual factors for significantly intense reflections | 0.075 |
Weighted residual factors for all reflections included in the refinement | 0.0788 |
Goodness-of-fit parameter for all reflections included in the refinement | 1.056 |
Diffraction radiation probe | x-ray |
Diffraction radiation wavelength | 0.71073 Å |
Diffraction radiation type | MoKα |