Information card for entry 7708348
Formula | C74 H60 F8 O10 P4 S2 Sn |
Calculated formula | C74 H60 F8 O10 P4 S2 Sn |
SMILES | [Sn](F)(F)([O]=P(c1ccccc1)(c1ccccc1)c1ccccc1)([O]=P(c1ccccc1)(c1ccccc1)c1ccccc1)([O]=P(c1ccccc1)(c1ccccc1)c1ccccc1)[O]=P(c1ccccc1)(c1ccccc1)c1ccccc1.S(=O)(=O)([O-])C(F)(F)F.S(=O)(=O)([O-])C(F)(F)F |
Title of publication | Tin(IV) fluoride complexes with neutral phosphine coordination and comparisons with hard N- and O-donor ligands |
Authors of publication | King, Rhus P.; Woodward, Madeleine; Grigg, Julian; McRobbie, Graeme; Levason, William; Reid, Gillian |
Journal of publication | Dalton Transactions |
Year of publication | 2021 |
a | 13.7031 ± 0.0003 Å |
b | 15.6126 ± 0.0004 Å |
c | 18.1412 ± 0.0004 Å |
α | 69.74 ± 0.002° |
β | 70.468 ± 0.002° |
γ | 76.875 ± 0.002° |
Cell volume | 3404.2 ± 0.15 Å3 |
Cell temperature | 100.01 ± 0.1 K |
Ambient diffraction temperature | 100.01 ± 0.1 K |
Number of distinct elements | 7 |
Space group number | 2 |
Hermann-Mauguin space group symbol | P -1 |
Hall space group symbol | -P 1 |
Residual factor for all reflections | 0.0663 |
Residual factor for significantly intense reflections | 0.0469 |
Weighted residual factors for significantly intense reflections | 0.116 |
Weighted residual factors for all reflections included in the refinement | 0.1301 |
Goodness-of-fit parameter for all reflections included in the refinement | 1.02 |
Diffraction radiation probe | x-ray |
Diffraction radiation wavelength | 0.71073 Å |
Diffraction radiation type | MoKα |