Information card for entry 7708482
Formula |
C41.5 H34.5 Mn3 N16.5 Na2 O12.5 |
Calculated formula |
C41.5 H34.5 Mn3 N16.5 Na2 O12.5 |
Title of publication |
Modulating the relaxation dynamics of the Na2Mn3 system via an auxiliary anion change |
Authors of publication |
Li, Yongfei; Sun, Xiao; Chen, Peiqiong; Liu, Hou-Ting; Li, Jing; Liu, Dan; Li, Dacheng; Dou, Jianmin; Tian, Haiquan |
Journal of publication |
Dalton Transactions |
Year of publication |
2021 |
a |
12.0857 ± 0.0004 Å |
b |
16.1733 ± 0.0006 Å |
c |
17.0208 ± 0.0008 Å |
α |
113.084 ± 0.004° |
β |
94.696 ± 0.003° |
γ |
96.905 ± 0.003° |
Cell volume |
3007.9 ± 0.2 Å3 |
Cell temperature |
142 ± 9 K |
Ambient diffraction temperature |
142 ± 9 K |
Number of distinct elements |
6 |
Space group number |
2 |
Hermann-Mauguin space group symbol |
P -1 |
Hall space group symbol |
-P 1 |
Residual factor for all reflections |
0.061 |
Residual factor for significantly intense reflections |
0.0435 |
Weighted residual factors for significantly intense reflections |
0.1447 |
Weighted residual factors for all reflections included in the refinement |
0.1747 |
Goodness-of-fit parameter for all reflections included in the refinement |
0.691 |
Diffraction radiation wavelength |
1.54184 Å |
Diffraction radiation type |
CuKα |
Yes |
Yes |
No |