Information card for entry 7708502
Common name | plutonyldichloride bis(tricyclohexylphosphine oxide) |
Chemical name | plutoniumdioxodicholoro bis(tricyclyhexylphosphine oxide) |
Formula | C36 H66 Cl2 O4 P2 Pu |
Calculated formula | C36 H66 Cl2 O4 P2 Pu |
Title of publication | Synthesis, characterization, and theoretical analysis of a plutonyl phosphine oxide complex |
Authors of publication | Windorff, Cory James; Beltrán Leiva, María Joaquina; Albrecht-Schmitt, Thomas E.; Bai, Zhuanling; Celis-Barros, Cristian; Goodwin, Conrad Alexander Phillip; Huffman, Zachary; McKinnon, Noah C.; Sperling, Joseph M. |
Journal of publication | Dalton Transactions |
Year of publication | 2021 |
a | 8.7416 ± 0.0004 Å |
b | 14.1281 ± 0.0007 Å |
c | 17.1398 ± 0.0008 Å |
α | 69.306 ± 0.004° |
β | 89.512 ± 0.004° |
γ | 76.786 ± 0.004° |
Cell volume | 1921.72 ± 0.17 Å3 |
Cell temperature | 100 ± 2 K |
Ambient diffraction temperature | 100 ± 2 K |
Number of distinct elements | 6 |
Space group number | 2 |
Hermann-Mauguin space group symbol | P -1 |
Hall space group symbol | -P 1 |
Residual factor for all reflections | 0.0832 |
Residual factor for significantly intense reflections | 0.0399 |
Weighted residual factors for significantly intense reflections | 0.0782 |
Weighted residual factors for all reflections included in the refinement | 0.0829 |
Goodness-of-fit parameter for all reflections included in the refinement | 0.877 |
Diffraction radiation probe | x-ray |
Diffraction radiation wavelength | 0.71073 Å |
Diffraction radiation type | MoKα |