Information card for entry 7708512
Formula | C156 H120 Eu4 N10 O28 S6 |
Calculated formula | C156 H120 Eu4 N10 O28 S6 |
Title of publication | New Ln-MOFs based on mixed organic ligands: synthesis, structure and efficient luminescence sensing of the Hg2+ ion in aqueous solutions |
Authors of publication | Wang, Shu-ju; Li, Qian; Xiu, Guan-Lin; You, Li-Xin; Ding, Fu; Van Deun, Rik; Dragutan, Ileana; Dragutan, Valerian; Sun, Yaguang |
Journal of publication | Dalton Transactions |
Year of publication | 2021 |
a | 11.4955 ± 0.0001 Å |
b | 22.0977 ± 0.0003 Å |
c | 29.098 ± 0.0003 Å |
α | 108.942 ± 0.001° |
β | 90.104 ± 0.001° |
γ | 98.54 ± 0.001° |
Cell volume | 6903.91 ± 0.14 Å3 |
Cell temperature | 100 ± 0.1 K |
Ambient diffraction temperature | 100 ± 0.1 K |
Number of distinct elements | 6 |
Space group number | 2 |
Hermann-Mauguin space group symbol | P -1 |
Hall space group symbol | -P 1 |
Residual factor for all reflections | 0.0454 |
Residual factor for significantly intense reflections | 0.0398 |
Weighted residual factors for significantly intense reflections | 0.1048 |
Weighted residual factors for all reflections included in the refinement | 0.1078 |
Goodness-of-fit parameter for all reflections included in the refinement | 1.053 |
Diffraction radiation probe | x-ray |
Diffraction radiation wavelength | 1.54184 Å |
Diffraction radiation type | CuKα |