Information card for entry 7708541
Formula | C27 H30 Cl N5 O Pt |
Calculated formula | C27 H30 Cl N5 O Pt |
SMILES | [Pt]1(C(N(c2[n]1ccc(c2)C)C(=O)N(C)C)=Nc1c(cccc1C)C)(Cl)C#[N]c1c(cccc1C)C |
Title of publication | Deprotonated diaminocarbene platinum complexes for thermoresponsive luminescent silicone materials: both catalysts and luminophores |
Authors of publication | Dobrynin, Mikhail V.; Kasatkina, Svetlana; Baykov, Sergey; Savko, Polina; Antonov, Nikita; Mikherdov, Alexander S.; Boyarskiy, Vadim; Islamova, Regina M. |
Journal of publication | Dalton Transactions |
Year of publication | 2021 |
a | 7.5595 ± 0.0001 Å |
b | 29.0139 ± 0.0004 Å |
c | 11.9767 ± 0.0002 Å |
α | 90° |
β | 101.368 ± 0.001° |
γ | 90° |
Cell volume | 2575.32 ± 0.07 Å3 |
Cell temperature | 100 ± 2 K |
Ambient diffraction temperature | 100 ± 2 K |
Number of distinct elements | 6 |
Space group number | 14 |
Hermann-Mauguin space group symbol | P 1 21/c 1 |
Hall space group symbol | -P 2ybc |
Residual factor for all reflections | 0.0317 |
Residual factor for significantly intense reflections | 0.0281 |
Weighted residual factors for significantly intense reflections | 0.0697 |
Weighted residual factors for all reflections included in the refinement | 0.0717 |
Goodness-of-fit parameter for all reflections included in the refinement | 1.098 |
Diffraction radiation probe | x-ray |
Diffraction radiation wavelength | 1.54184 Å |
Diffraction radiation type | CuKα |