Information card for entry 7708557
Formula |
C24 H30 Ag Cl N2 |
Calculated formula |
C24 H30 Ag Cl N2 |
Title of publication |
Synthesis, characterization, antimicrobial and antibiofilm activity, and molecular docking analysis of NHC precursors and their Ag-NHC complexes |
Authors of publication |
Üstün, Elvan; Şahin, Neslihan; Çelik, Cem; Tutar, Uğur; Özdemir, Namık; Gürbüz, Nevin; Özdemir, İsmail |
Journal of publication |
Dalton Transactions |
Year of publication |
2021 |
a |
11.1956 ± 0.0009 Å |
b |
15.9222 ± 0.0009 Å |
c |
12.9237 ± 0.001 Å |
α |
90° |
β |
99.791 ± 0.006° |
γ |
90° |
Cell volume |
2270.2 ± 0.3 Å3 |
Cell temperature |
296 ± 2 K |
Ambient diffraction temperature |
296 ± 2 K |
Number of distinct elements |
5 |
Space group number |
14 |
Hermann-Mauguin space group symbol |
P 1 21/c 1 |
Hall space group symbol |
-P 2ybc |
Residual factor for all reflections |
0.0512 |
Residual factor for significantly intense reflections |
0.0335 |
Weighted residual factors for significantly intense reflections |
0.0794 |
Weighted residual factors for all reflections included in the refinement |
0.0847 |
Goodness-of-fit parameter for all reflections included in the refinement |
1.009 |
Diffraction radiation wavelength |
0.71073 Å |
Diffraction radiation type |
MoKα |
Yes |
Yes |
No |