Information card for entry 7708568
Formula | C17 H15 Cl2 N3 O2 Ru |
Calculated formula | C17 H15 Cl2 N3 O2 Ru |
SMILES | [Ru]1(Cl)(Cl)(C#[O])(C#[O])[NH](Cc2[n]1c1ccccc1[nH]2)c1ccc(cc1)C |
Title of publication | Light-activated cytotoxicity of dicarbonyl Ru(ii) complexes with a benzimidazole coligand towards breast cancer |
Authors of publication | Ibrahim, Nourhan M.; Khaled, Rabaa M.; Ragheb, Mohamed A.; Radacki, Krzysztof; Farag, Ahmad M.; Mansour, Ahmed M. |
Journal of publication | Dalton Transactions |
Year of publication | 2021 |
a | 13.75386 ± 0.00013 Å |
b | 8.76188 ± 0.00007 Å |
c | 15.45738 ± 0.00015 Å |
α | 90° |
β | 101.907 ± 0.0009° |
γ | 90° |
Cell volume | 1822.69 ± 0.03 Å3 |
Cell temperature | 100.01 ± 0.1 K |
Ambient diffraction temperature | 100.01 ± 0.1 K |
Number of distinct elements | 6 |
Space group number | 14 |
Hermann-Mauguin space group symbol | P 1 21/n 1 |
Hall space group symbol | -P 2yn |
Residual factor for all reflections | 0.0293 |
Residual factor for significantly intense reflections | 0.0287 |
Weighted residual factors for significantly intense reflections | 0.082 |
Weighted residual factors for all reflections included in the refinement | 0.0825 |
Goodness-of-fit parameter for all reflections included in the refinement | 1.074 |
Diffraction radiation probe | x-ray |
Diffraction radiation wavelength | 1.54184 Å |
Diffraction radiation type | CuKα |