Information card for entry 7708651
Formula |
C65 H84 Cl10 I4 N14 |
Calculated formula |
C65 H84 Cl10 I4 N14 |
Title of publication |
Coupling of CO2 and Epoxides Catalysed by Novel N-Fused Mesoionic Carbene Complexes of Nickel(II) |
Authors of publication |
Watt, Fabian A.; Sieland, Benedikt; Dickmann, Nicole; Schoch, Roland; Herbst-Irmer, Regine; Ott, Holger; Paradies, Jan; Kuckling, Dirk; Hohloch, Stephan |
Journal of publication |
Dalton Transactions |
Year of publication |
2021 |
a |
11.5044 ± 0.0019 Å |
b |
17.383 ± 0.003 Å |
c |
22.708 ± 0.004 Å |
α |
69.113 ± 0.003° |
β |
85.019 ± 0.003° |
γ |
88.293 ± 0.003° |
Cell volume |
4226.7 ± 1.3 Å3 |
Cell temperature |
130 ± 2 K |
Ambient diffraction temperature |
130 ± 2 K |
Number of distinct elements |
5 |
Space group number |
2 |
Hermann-Mauguin space group symbol |
P -1 |
Hall space group symbol |
-P 1 |
Residual factor for all reflections |
0.0954 |
Residual factor for significantly intense reflections |
0.0722 |
Weighted residual factors for significantly intense reflections |
0.1987 |
Weighted residual factors for all reflections included in the refinement |
0.2154 |
Goodness-of-fit parameter for all reflections included in the refinement |
1.025 |
Diffraction radiation wavelength |
0.71073 Å |
Diffraction radiation type |
MoKα |
Yes |
Yes |
No |