Information card for entry 7708658
Formula | C35 H44 Au2 Cl4 N6 P2 |
Calculated formula | C35 H44 Au2 Cl4 N6 P2 |
Title of publication | Group 11 metal complexes of a dinucleating triazole appended bisphosphine, 1,4-bis(5-(diisopropylphosphaneyl)-1-phenyl-1H-1,2,3-triazol-4-yl)benzene |
Authors of publication | Kote, Basvaraj S.; Kunchur, Harish S.; Radhakrishna, Latchupatula; Pandey, Madhusudan Kumar; Balakrishna, Maravanji Shivaramaiah |
Journal of publication | Dalton Transactions |
Year of publication | 2021 |
a | 9.2017 ± 0.0002 Å |
b | 32.7903 ± 0.0006 Å |
c | 13.2599 ± 0.0003 Å |
α | 90° |
β | 98.888 ± 0.002° |
γ | 90° |
Cell volume | 3952.82 ± 0.15 Å3 |
Cell temperature | 150 ± 0.1 K |
Ambient diffraction temperature | 150 ± 0.1 K |
Number of distinct elements | 6 |
Space group number | 14 |
Hermann-Mauguin space group symbol | P 1 21/c 1 |
Hall space group symbol | -P 2ybc |
Residual factor for all reflections | 0.0547 |
Residual factor for significantly intense reflections | 0.0358 |
Weighted residual factors for significantly intense reflections | 0.0793 |
Weighted residual factors for all reflections included in the refinement | 0.0889 |
Goodness-of-fit parameter for all reflections included in the refinement | 1.018 |
Diffraction radiation probe | x-ray |
Diffraction radiation wavelength | 0.71073 Å |
Diffraction radiation type | MoKα |