Information card for entry 7708681
Formula | C56.4 H54.8 B Cu F4 N2 O1.8 P2 |
Calculated formula | C54 H50 B Cu F4 N2 O P2 |
Title of publication | A counterion study of a series of [Cu(P^P)(N^N)][A] compounds with bis(phosphane) and 6-methyl and 6,6'-dimethyl-substituted 2,2'-bipyridine ligands for light-emitting electrochemical cells |
Authors of publication | Meyer, Marco; Mardegan, Lorenzo; Tordera, Daniel; Prescimone, Alessandro; Sessolo, Michele; Bolink, Henk J.; Constable, Edwin C.; Housecroft, Catherine E. |
Journal of publication | Dalton Transactions |
Year of publication | 2021 |
a | 11.0536 ± 0.0007 Å |
b | 14.3637 ± 0.0009 Å |
c | 18.0991 ± 0.0012 Å |
α | 67.326 ± 0.003° |
β | 77.613 ± 0.003° |
γ | 85.13 ± 0.003° |
Cell volume | 2589.8 ± 0.3 Å3 |
Cell temperature | 150 K |
Ambient diffraction temperature | 150 K |
Number of distinct elements | 8 |
Space group number | 2 |
Hermann-Mauguin space group symbol | P -1 |
Hall space group symbol | -P 1 |
Residual factor for all reflections | 0.0613 |
Residual factor for significantly intense reflections | 0.0583 |
Weighted residual factors for significantly intense reflections | 0.1805 |
Weighted residual factors for all reflections included in the refinement | 0.1842 |
Goodness-of-fit parameter for all reflections included in the refinement | 1.047 |
Diffraction radiation probe | x-ray |
Diffraction radiation wavelength | 1.54178 Å |
Diffraction radiation type | CuKα |