Information card for entry 7708767
Formula |
C49 H63 Cl2 Eu O15 Ti2 |
Calculated formula |
C49 H63 Cl2 Eu O15 Ti2 |
Title of publication |
Titanium Compounds Containing Naturally Occurring Dye Molecules |
Authors of publication |
Fang, Wei-hui; Muller, Rosa; Jethwa, Rajesh Bharat; Riesgo-González, Victor; Li, Ning; Pike, Sebastian D.; Bond, Andrew David; Luo, He-Kuan; Zhang, Chen; Wright, Dominic S. |
Journal of publication |
Dalton Transactions |
Year of publication |
2021 |
a |
15.5101 ± 0.0003 Å |
b |
15.5865 ± 0.0003 Å |
c |
22.8777 ± 0.0005 Å |
α |
85.4138 ± 0.0012° |
β |
79.8656 ± 0.0012° |
γ |
86.3382 ± 0.0011° |
Cell volume |
5419.93 ± 0.19 Å3 |
Cell temperature |
180 ± 2 K |
Ambient diffraction temperature |
180 ± 2 K |
Number of distinct elements |
6 |
Space group number |
2 |
Hermann-Mauguin space group symbol |
P -1 |
Hall space group symbol |
-P 1 |
Residual factor for all reflections |
0.0995 |
Residual factor for significantly intense reflections |
0.0597 |
Weighted residual factors for significantly intense reflections |
0.1277 |
Weighted residual factors for all reflections included in the refinement |
0.1466 |
Goodness-of-fit parameter for all reflections included in the refinement |
1.038 |
Diffraction radiation wavelength |
1.54178 Å |
Diffraction radiation type |
CuKα |
Yes |
No |
No |