Information card for entry 7708773
Formula |
C28 H26 N4 O11 Zn2 |
Calculated formula |
C28 H26 N4 O11 Zn2 |
Title of publication |
An AIE material with time-dependent luminescence conversion obtained by 2D coordination polymer modification via covalent post-synthetic modification |
Authors of publication |
He, Liancheng; Wang, Rui-dong; Wang, Shuyu; Zhu, Rong-Rong; Li, Zhihao; Wu, Yuan-yuan; Ma, Jie; Du, Lin; Zhao, Qi-Hua |
Journal of publication |
Dalton Transactions |
Year of publication |
2021 |
a |
7.9486 ± 0.0009 Å |
b |
12.9217 ± 0.0015 Å |
c |
13.963 ± 0.0017 Å |
α |
90° |
β |
90.085 ± 0.006° |
γ |
90° |
Cell volume |
1434.1 ± 0.3 Å3 |
Cell temperature |
293 ± 2 K |
Ambient diffraction temperature |
293 ± 2 K |
Number of distinct elements |
5 |
Space group number |
14 |
Hermann-Mauguin space group symbol |
P 1 21/n 1 |
Hall space group symbol |
-P 2yn |
Residual factor for all reflections |
0.0868 |
Residual factor for significantly intense reflections |
0.0565 |
Weighted residual factors for significantly intense reflections |
0.135 |
Weighted residual factors for all reflections included in the refinement |
0.1599 |
Goodness-of-fit parameter for all reflections included in the refinement |
1.087 |
Diffraction radiation wavelength |
0.71073 Å |
Diffraction radiation type |
MoKα |
Yes |
Yes |
No |