Information card for entry 7708804
Formula | C37.77 H43.77 B9 Cl2.3 O Os P2 |
Calculated formula | C37.768 H43.768 B9 Cl2.304 O Os P2 |
Title of publication | A simple and high-yield route to iridium, rhodium, osmium and ruthenium nido-6-metalladecaborane compounds |
Authors of publication | Bould, Jonathan; Londesborough, Michael G. S.; Passarelli, Vincenzo; Clegg, William; Waddell, Paul G.; Cvačka, Josef; Macías, Ramón |
Journal of publication | Dalton Transactions |
Year of publication | 2021 |
a | 11.9431 ± 0.0003 Å |
b | 12.4326 ± 0.0003 Å |
c | 15.0763 ± 0.0003 Å |
α | 84.565 ± 0.0017° |
β | 78.068 ± 0.002° |
γ | 71.413 ± 0.002° |
Cell volume | 2074.98 ± 0.09 Å3 |
Cell temperature | 150 ± 2 K |
Ambient diffraction temperature | 150 ± 2 K |
Number of distinct elements | 7 |
Space group number | 2 |
Hermann-Mauguin space group symbol | P -1 |
Hall space group symbol | -P 1 |
Residual factor for all reflections | 0.0289 |
Residual factor for significantly intense reflections | 0.0244 |
Weighted residual factors for significantly intense reflections | 0.0563 |
Weighted residual factors for all reflections included in the refinement | 0.0586 |
Goodness-of-fit parameter for all reflections included in the refinement | 1.037 |
Diffraction radiation wavelength | 1.54184 Å |
Diffraction radiation type | CuKα |