Information card for entry 7708809
Formula | C9 H6.5 N7.5 O2 Zn |
Calculated formula | C9 H6.5 N7.5 O2 Zn |
Title of publication | Anion-controlled Zn(II) Coordination Polymers with 1-(tetrazo-5-yl)-3-(triazo-1-yl) benzene as an Assembling Ligand: Synthesis, Characterization, and Efficient Detection of Tryptophan in Water |
Authors of publication | Sun, Hanxu; Zhou, Jie; Zhang, Zhen; He, Mei; He, Liancheng; Du, Lin; Xie, Mingjin; Zhao, Qi-Hua |
Journal of publication | Dalton Transactions |
Year of publication | 2021 |
a | 15.4732 ± 0.0004 Å |
b | 7.4234 ± 0.0002 Å |
c | 19.6348 ± 0.0005 Å |
α | 90° |
β | 107.759 ± 0.001° |
γ | 90° |
Cell volume | 2147.86 ± 0.1 Å3 |
Cell temperature | 170 ± 2 K |
Ambient diffraction temperature | 170 ± 2 K |
Number of distinct elements | 5 |
Space group number | 15 |
Hermann-Mauguin space group symbol | C 1 2/c 1 |
Hall space group symbol | -C 2yc |
Residual factor for all reflections | 0.028 |
Residual factor for significantly intense reflections | 0.0232 |
Weighted residual factors for significantly intense reflections | 0.0536 |
Weighted residual factors for all reflections included in the refinement | 0.0564 |
Goodness-of-fit parameter for all reflections included in the refinement | 1.074 |
Diffraction radiation wavelength | 0.71073 Å |
Diffraction radiation type | MoKα |