Information card for entry 7708851
Formula | C26 H46 N2 P2 Sn |
Calculated formula | C26 H46 N2 P2 Sn |
SMILES | [Sn]1([P](C(C)(C)C)(Cc2n1ccc2)C(C)(C)C)n1c(ccc1)CP(C(C)(C)C)C(C)(C)C |
Title of publication | Stannylenes based on pyrrole-phosphane and dipyrromethane-diphosphane scaffolds: syntheses and behavior as precursors to PSnP pincer palladium(II), palladium(0) and gold(I) complexes. |
Authors of publication | Cabeza, Javier A.; Fernández, Israel; García-Álvarez, Pablo; García-Soriano, Rubén; Laglera-Gándara, Carlos J; Toral, Rubén |
Journal of publication | Dalton transactions (Cambridge, England : 2003) |
Year of publication | 2021 |
Journal volume | 50 |
Journal issue | 44 |
Pages of publication | 16122 - 16132 |
a | 12.1119 ± 0.0007 Å |
b | 20.3951 ± 0.0013 Å |
c | 12.8713 ± 0.0008 Å |
α | 90° |
β | 116.512 ± 0.003° |
γ | 90° |
Cell volume | 2845.2 ± 0.3 Å3 |
Cell temperature | 100 ± 2 K |
Ambient diffraction temperature | 100 ± 2 K |
Number of distinct elements | 5 |
Space group number | 14 |
Hermann-Mauguin space group symbol | P 1 21/n 1 |
Hall space group symbol | -P 2yn |
Residual factor for all reflections | 0.0245 |
Residual factor for significantly intense reflections | 0.0189 |
Weighted residual factors for significantly intense reflections | 0.0425 |
Weighted residual factors for all reflections included in the refinement | 0.0444 |
Goodness-of-fit parameter for all reflections included in the refinement | 1.036 |
Diffraction radiation wavelength | 0.71069 Å |
Diffraction radiation type | MoKα |