Information card for entry 7708866
Formula |
C29 H32 La N3 O9 |
Calculated formula |
C29 H32 La N3 O9 |
Title of publication |
A series of microporous and robust Ln-MOFs showing luminescent properties and catalytic performances towards Knoevenagel reactions |
Authors of publication |
Yao, Qing-Xia; Tian, Miaomiao; Zheng, Jun; Xue, Jintang; Pan, Xuze; Zhou, Dandan; Li, Yun-Wu; Duan, Wen-zeng; Su, Jie; Huang, Xianqiang |
Journal of publication |
Dalton Transactions |
Year of publication |
2021 |
a |
9.6585 ± 0.0004 Å |
b |
13.177 ± 0.0008 Å |
c |
13.4502 ± 0.0006 Å |
α |
109.003 ± 0.005° |
β |
90.77 ± 0.004° |
γ |
110.333 ± 0.004° |
Cell volume |
1502.12 ± 0.15 Å3 |
Cell temperature |
139 K |
Ambient diffraction temperature |
139 K |
Number of distinct elements |
5 |
Space group number |
2 |
Hermann-Mauguin space group symbol |
P -1 |
Hall space group symbol |
-P 1 |
Residual factor for all reflections |
0.0934 |
Residual factor for significantly intense reflections |
0.0857 |
Weighted residual factors for significantly intense reflections |
0.2346 |
Weighted residual factors for all reflections included in the refinement |
0.2453 |
Goodness-of-fit parameter for all reflections included in the refinement |
1.071 |
Diffraction radiation wavelength |
1.54178 Å |
Diffraction radiation type |
CuKα |
Yes |
No |
No |