Information card for entry 7708868
Formula |
C29 H30 Eu N3 O8 |
Calculated formula |
C29 H30 Eu N3 O8 |
Title of publication |
A series of microporous and robust Ln-MOFs showing luminescent properties and catalytic performances towards Knoevenagel reactions |
Authors of publication |
Yao, Qing-Xia; Tian, Miaomiao; Zheng, Jun; Xue, Jintang; Pan, Xuze; Zhou, Dandan; Li, Yun-Wu; Duan, Wen-zeng; Su, Jie; Huang, Xianqiang |
Journal of publication |
Dalton Transactions |
Year of publication |
2021 |
a |
8.9015 ± 0.0004 Å |
b |
13.3596 ± 0.0005 Å |
c |
13.7307 ± 0.0005 Å |
α |
112.081 ± 0.003° |
β |
92.335 ± 0.003° |
γ |
107.726 ± 0.003° |
Cell volume |
1418.81 ± 0.11 Å3 |
Cell temperature |
293 ± 2 K |
Ambient diffraction temperature |
293 ± 2 K |
Number of distinct elements |
5 |
Space group number |
2 |
Hermann-Mauguin space group symbol |
P -1 |
Hall space group symbol |
-P 1 |
Residual factor for all reflections |
0.0544 |
Residual factor for significantly intense reflections |
0.0477 |
Weighted residual factors for significantly intense reflections |
0.1096 |
Weighted residual factors for all reflections included in the refinement |
0.1128 |
Goodness-of-fit parameter for all reflections included in the refinement |
1.092 |
Diffraction radiation wavelength |
0.71073 Å |
Diffraction radiation type |
MoKα |
Yes |
Yes |
No |