Information card for entry 7708911
Formula | C58 H132 Ag20 N16 O36 S10 |
Calculated formula | C58 H132 Ag20 N16 O36 S10 |
Title of publication | Self-assembly patterns of non-metalloid silver thiolates: structural, HR-ESI-MS and stability studies |
Authors of publication | Chupina, Anastasia; Abramov, Pavel A.; Yanshole, Vadim V.; Sulyaeva, Veronica S.; Kokovkin, Vasily; Sokolov, Maksim Nailyevich |
Journal of publication | Dalton Transactions |
Year of publication | 2021 |
a | 16.9481 ± 0.0009 Å |
b | 12.526 ± 0.0007 Å |
c | 26.7721 ± 0.0013 Å |
α | 90° |
β | 92.723 ± 0.004° |
γ | 90° |
Cell volume | 5677.1 ± 0.5 Å3 |
Cell temperature | 140 ± 2 K |
Ambient diffraction temperature | 140 ± 2 K |
Number of distinct elements | 6 |
Space group number | 14 |
Hermann-Mauguin space group symbol | P 1 21/n 1 |
Hall space group symbol | -P 2yn |
Residual factor for all reflections | 0.1002 |
Residual factor for significantly intense reflections | 0.05 |
Weighted residual factors for significantly intense reflections | 0.0775 |
Weighted residual factors for all reflections included in the refinement | 0.0888 |
Goodness-of-fit parameter for all reflections included in the refinement | 0.967 |
Diffraction radiation probe | x-ray |
Diffraction radiation wavelength | 0.71073 Å |
Diffraction radiation type | MoKα |