Information card for entry 7708913
Formula | C41 H86 Ag16 Br N8 O18 S8 |
Calculated formula | C41 H86 Ag16 Br N8 O18 S8 |
Title of publication | Self-assembly patterns of non-metalloid silver thiolates: structural, HR-ESI-MS and stability studies |
Authors of publication | Chupina, Anastasia; Abramov, Pavel A.; Yanshole, Vadim V.; Sulyaeva, Veronica S.; Kokovkin, Vasily; Sokolov, Maksim Nailyevich |
Journal of publication | Dalton Transactions |
Year of publication | 2021 |
a | 18.2444 ± 0.0005 Å |
b | 41.9711 ± 0.0012 Å |
c | 15.2141 ± 0.0006 Å |
α | 90° |
β | 91.211 ± 0.003° |
γ | 90° |
Cell volume | 11647.4 ± 0.7 Å3 |
Cell temperature | 120 ± 2 K |
Ambient diffraction temperature | 120 ± 2 K |
Number of distinct elements | 7 |
Space group number | 15 |
Hermann-Mauguin space group symbol | C 1 2/c 1 |
Hall space group symbol | -C 2yc |
Residual factor for all reflections | 0.1099 |
Residual factor for significantly intense reflections | 0.0627 |
Weighted residual factors for significantly intense reflections | 0.1912 |
Weighted residual factors for all reflections included in the refinement | 0.2103 |
Goodness-of-fit parameter for all reflections included in the refinement | 1.119 |
Diffraction radiation probe | x-ray |
Diffraction radiation wavelength | 0.71073 Å |
Diffraction radiation type | MoKα |