Information card for entry 7709223
Formula | C142 H85 B4 Co2 F79 N40 O |
Calculated formula | C142 H85 B4 Co2 F79 N40 O |
Title of publication | Spin-state control of cobalt(II) and iron(II) complexes with click-derived tripodal ligands through non-covalent and fluorine-specific interactions. |
Authors of publication | Nößler, Maite; Hunger, David; Reichert, Felix; Winkler, Mario; Reimann, Marc; Klein, Johannes; Suhr, Simon; Suntrup, Lisa; Beerhues, Julia; Kaupp, Martin; van Slageren, Joris; Sarkar, Biprajit |
Journal of publication | Dalton transactions (Cambridge, England : 2003) |
Year of publication | 2021 |
Journal volume | 50 |
Journal issue | 48 |
Pages of publication | 18097 - 18106 |
a | 11.7351 ± 0.001 Å |
b | 18.92 ± 0.002 Å |
c | 19.26 ± 0.002 Å |
α | 68.474 ± 0.004° |
β | 80.359 ± 0.003° |
γ | 86.509 ± 0.003° |
Cell volume | 3921.8 ± 0.7 Å3 |
Cell temperature | 100 K |
Ambient diffraction temperature | 100 K |
Number of distinct elements | 7 |
Space group number | 2 |
Hermann-Mauguin space group symbol | P -1 |
Hall space group symbol | -P 1 |
Residual factor for all reflections | 0.0713 |
Residual factor for significantly intense reflections | 0.049 |
Weighted residual factors for significantly intense reflections | 0.1099 |
Weighted residual factors for all reflections included in the refinement | 0.1236 |
Goodness-of-fit parameter for all reflections included in the refinement | 1.041 |
Diffraction radiation wavelength | 0.71073 Å |
Diffraction radiation type | MoKα |