Information card for entry 7709262
Formula | C108 H100 Cl8 Fe4 N20 O40 |
Calculated formula | C108 H100 Cl8 Fe4 N20 O40 |
Title of publication | Hydrogen-atom and oxygen-atom transfer reactivities of iron(iv)-oxo complexes of quinoline-substituted pentadentate ligands |
Authors of publication | Munshi, Sandip; Sinha, Arup; Yiga, Solomon; Banerjee, Sridhar; Singh, Reena; Hossain, Md. Kamal; Haukka, Matti; Valiati, Andrei Felipe; Huelsmann, Ricardo Dagnoni; Martendal, Edmar; Peralta, Rosely; Xavier, Fernando; Wendt, Ola F.; Paine, Tapan K.; Nordlander, Ebbe |
Journal of publication | Dalton Transactions |
Year of publication | 2022 |
a | 12.4606 ± 0.0013 Å |
b | 17.2148 ± 0.0019 Å |
c | 13.1304 ± 0.0013 Å |
α | 90° |
β | 99.235 ± 0.004° |
γ | 90° |
Cell volume | 2780.1 ± 0.5 Å3 |
Cell temperature | 130 K |
Ambient diffraction temperature | 130 K |
Number of distinct elements | 6 |
Space group number | 14 |
Hermann-Mauguin space group symbol | P 1 21/n 1 |
Hall space group symbol | -P 2yn |
Residual factor for all reflections | 0.1354 |
Residual factor for significantly intense reflections | 0.0928 |
Weighted residual factors for significantly intense reflections | 0.215 |
Weighted residual factors for all reflections included in the refinement | 0.2321 |
Goodness-of-fit parameter for all reflections included in the refinement | 1.291 |
Diffraction radiation wavelength | 0.71073 Å |
Diffraction radiation type | MoKα |