Information card for entry 7709332
Formula |
C59 H99 Mo12 N8 O40 P Zn4 |
Calculated formula |
C59 H95 Mo12 N8 O40 P Zn4 |
Title of publication |
Two POM-based compounds containing Zn-capped Keggin anions as decent heterogeneous catalysts for sulfur oxidation and cycloaddition of CO2 reactions |
Authors of publication |
Zhu, Yinhua; Yang, Jianbo; Liu, Xiaomei; Wang, Jilei; Ping, Qingdong; Du, Zeyu; Li, Jianian; Zang, Tingting; Mei, Hua; Xu, Yan |
Journal of publication |
Dalton Transactions |
Year of publication |
2022 |
a |
32.635 ± 0.002 Å |
b |
32.635 ± 0.002 Å |
c |
34.282 ± 0.003 Å |
α |
90° |
β |
90° |
γ |
90° |
Cell volume |
36512 ± 4 Å3 |
Cell temperature |
296 ± 2 K |
Ambient diffraction temperature |
296 ± 2 K |
Number of distinct elements |
7 |
Space group number |
110 |
Hermann-Mauguin space group symbol |
I 41 c d |
Hall space group symbol |
I 4bw -2c |
Residual factor for all reflections |
0.0428 |
Residual factor for significantly intense reflections |
0.0339 |
Weighted residual factors for significantly intense reflections |
0.0751 |
Weighted residual factors for all reflections included in the refinement |
0.0791 |
Goodness-of-fit parameter for all reflections included in the refinement |
1.064 |
Diffraction radiation wavelength |
0.71073 Å |
Diffraction radiation type |
MoKα |
Yes |
No |
No |