Information card for entry 7709354
Formula | C97 H152 Cl Dy3 Li N9 O7 Si6 |
Calculated formula | C97 H152 Cl Dy3 Li N9 O7 Si6 |
Title of publication | Synthesis and characterization of rare-earth metallate amido complexes bearing 2-amidate-functionalized indolyl ligand and their application in the hydroboration of esters with pinacolborane |
Authors of publication | Wei, Yun; Bao, Qin; Song, Lulu; Hong, Dongjing; Gao, Jianjian; Wang, Shaowu; Zhu, Xiancui; Zhou, Shuangliu; Mu, Xiaolong |
Journal of publication | Dalton Transactions |
Year of publication | 2022 |
a | 19.827 ± 0.003 Å |
b | 20.177 ± 0.003 Å |
c | 21.529 ± 0.003 Å |
α | 67.638 ± 0.002° |
β | 83.935 ± 0.002° |
γ | 61.667 ± 0.002° |
Cell volume | 6981.1 ± 1.8 Å3 |
Cell temperature | 298.15 K |
Ambient diffraction temperature | 298.15 K |
Number of distinct elements | 8 |
Space group number | 2 |
Hermann-Mauguin space group symbol | P -1 |
Hall space group symbol | -P 1 |
Residual factor for all reflections | 0.1751 |
Residual factor for significantly intense reflections | 0.0787 |
Weighted residual factors for significantly intense reflections | 0.177 |
Weighted residual factors for all reflections included in the refinement | 0.2199 |
Goodness-of-fit parameter for all reflections included in the refinement | 1.017 |
Diffraction radiation wavelength | 0.71073 Å |
Diffraction radiation type | MoKα |