Information card for entry 7709373
Common name | Mercury ocadecanoate |
Chemical name | Mercury stearate |
Formula | C36 H70 Hg O4 |
Calculated formula | C36 H70 Hg O4 |
Title of publication | Long-chain mercury carboxylates relevant to saponification in oil and tempera paintings: XRPD and ssNMR complementary study of the crystal structures |
Authors of publication | Barannikov, Ruslan; Kočí, Eva; Bezdička, Petr; Kobera, Libor; Mahun, Andrii; Rohlíček, Jan; Plocek, Jiri; Švarcová, Silvie |
Journal of publication | Dalton Transactions |
Year of publication | 2022 |
a | 100.294 ± 0.002 Å |
b | 4.86437 ± 0.00009 Å |
c | 7.51745 ± 0.00013 Å |
α | 90° |
β | 91.368 ± 0.002° |
γ | 90° |
Cell volume | 3666.47 ± 0.12 Å3 |
Cell temperature | 293 K |
Ambient diffraction temperature | 293 K |
Number of distinct elements | 4 |
Space group number | 15 |
Hermann-Mauguin space group symbol | C 1 2/c 1 |
Hall space group symbol | -C 2yc |
Residual factor for all reflections | 0.0297 |
Residual factor for significantly intense reflections | 0.0288 |
Weighted residual factors for all reflections | 0.0369 |
Weighted residual factors for significantly intense reflections | 0.0365 |
Goodness-of-fit parameter for all reflections | 2.28 |
Method of determination | powder diffraction |
Diffraction radiation probe | x-ray |
Diffraction radiation wavelength | 1.54187 Å |
Diffraction radiation type | CuKα |