Information card for entry 7709395
Formula |
B3 Cs3 O16 P4 |
Calculated formula |
B3 Cs3 O16 P4 |
Title of publication |
Variable dimensionality of the anion framework in four new borophosphates and fluoroborophosphates with short cutoff edges |
Authors of publication |
Zhang, Ruonan; Guo, Siru; Wang, Xuping; Yang, Rong; Chen, Zhen; Zhang, Wenyao; Zhang, Fangfang; Guo, Zhiyong; Han, Shujuan; Yang, Zhihua |
Journal of publication |
Dalton Transactions |
Year of publication |
2022 |
a |
13.0515 ± 0.0008 Å |
b |
15.3256 ± 0.001 Å |
c |
7.9289 ± 0.0005 Å |
α |
90° |
β |
96.283 ± 0.002° |
γ |
90° |
Cell volume |
1576.43 ± 0.17 Å3 |
Cell temperature |
302 K |
Ambient diffraction temperature |
302 K |
Number of distinct elements |
4 |
Space group number |
14 |
Hermann-Mauguin space group symbol |
P 1 21/c 1 |
Hall space group symbol |
-P 2ybc |
Residual factor for all reflections |
0.0493 |
Residual factor for significantly intense reflections |
0.042 |
Weighted residual factors for significantly intense reflections |
0.084 |
Weighted residual factors for all reflections included in the refinement |
0.0867 |
Goodness-of-fit parameter for all reflections included in the refinement |
1.104 |
Diffraction radiation wavelength |
0.71073 Å |
Diffraction radiation type |
MoKα |
Yes |
No |
No |