Information card for entry 7709457
Chemical name | AMF-42 |
Formula | C22 H36 N3 O6 P W |
Calculated formula | C22 H36 N3 O6 P W |
SMILES | [W]([P]1(ON2C(CCCC2(C)C)(C)C)N(CCN1C(C)C)C(C)C)(C#[O])(C#[O])(C#[O])(C#[O])C#[O] |
Title of publication | 1,3,2-Diheterophospholane complexes: access to new tuneable precursors of phosphanoxyl complexes and P-functional polymers |
Authors of publication | Brehm, Philipp; Müller-Feyen , Anne Sophie; Schnakenburg, Gregor; Streubel, R. |
Journal of publication | Dalton Transactions |
Year of publication | 2022 |
a | 12.1269 ± 0.0003 Å |
b | 10.9786 ± 0.0002 Å |
c | 20.1204 ± 0.0005 Å |
α | 90° |
β | 102.575 ± 0.002° |
γ | 90° |
Cell volume | 2614.5 ± 0.11 Å3 |
Cell temperature | 123 K |
Ambient diffraction temperature | 123 K |
Number of distinct elements | 6 |
Space group number | 14 |
Hermann-Mauguin space group symbol | P 1 21/n 1 |
Hall space group symbol | -P 2yn |
Residual factor for all reflections | 0.024 |
Residual factor for significantly intense reflections | 0.0185 |
Weighted residual factors for significantly intense reflections | 0.038 |
Weighted residual factors for all reflections included in the refinement | 0.0391 |
Goodness-of-fit parameter for all reflections included in the refinement | 0.982 |
Diffraction radiation wavelength | 0.71073 Å |
Diffraction radiation type | MoKα |