Information card for entry 7709467
Formula | C22 H28 Cl2 Cu N8 O2 S2 |
Calculated formula | C22 H28 Cl2 Cu N8 O2 S2 |
Title of publication | N,N′-Substituted thioureas and their metal complexes: syntheses, structures and electronic properties |
Authors of publication | Al-Riyahee, Ali A. A.; Horton, Peter N.; Coles, Simon J.; Berry, Colin; Horrocks, Paul D.; Pope, Simon J. A.; Amoroso, Angelo J. |
Journal of publication | Dalton Transactions |
Year of publication | 2022 |
a | 10.7026 ± 0.0008 Å |
b | 16.385 ± 0.0011 Å |
c | 7.9196 ± 0.0005 Å |
α | 90° |
β | 97.287 ± 0.002° |
γ | 90° |
Cell volume | 1377.58 ± 0.16 Å3 |
Cell temperature | 100 ± 2 K |
Ambient diffraction temperature | 100 ± 2 K |
Number of distinct elements | 7 |
Space group number | 14 |
Hermann-Mauguin space group symbol | P 1 21/c 1 |
Hall space group symbol | -P 2ybc |
Residual factor for all reflections | 0.0651 |
Residual factor for significantly intense reflections | 0.0619 |
Weighted residual factors for significantly intense reflections | 0.1616 |
Weighted residual factors for all reflections included in the refinement | 0.1671 |
Goodness-of-fit parameter for all reflections included in the refinement | 1.025 |
Diffraction radiation probe | x-ray |
Diffraction radiation wavelength | 0.71075 Å |
Diffraction radiation type | MoKα |